BDBM16439 3-{[1-(carboxymethyl)-2,5-dioxopyrrolidin-3-yl]sulfanyl}-2-acetamidopropanoic acid::N-Acetylcysteine, N-glycylthiosuccinimide
SMILES CC(=O)NC(CSC1CC(=O)N(CC(O)=O)C1=O)C(O)=O
InChI Key InChIKey=QKQXHWPRHPDOOT-UHFFFAOYSA-N
Data  1 KI
  Tab Delimited (TSV)   2D SDfile   Computed 3D by Vconf -m prep SDfile
Find this compound or compounds like it in BindingDB:
Activity Spreadsheet -- Enzyme Inhibition Constant Data from BindingDB
Found 1 hit for monomerid = 16439
TargetAldo-keto reductase family 1 member B1(Homo sapiens (Human))
Medical College of Wiscosin
LigandPNGBDBM16439(3-{[1-(carboxymethyl)-2,5-dioxopyrrolidin-3-yl]sul...)
Affinity DataKi:  2.30E+3nM. Assay description: The production of NADPH from NADP+ and benzyl alcohol and xylitol was monitored by an increase in NADPH fluorescence (ex: 340 nm; em: 460 nm) using a...
In DepthDetails ArticlePubMed